more data
range: Resource
domain: Resource
comment: Further information that may or may not be related to the subject resource.
type: Property

Linked Data vocabulary
comment: Temporary namesapce and vocabulary for linked data on the Semantic Web.